{"text_format":"1","workbook":"xlsx","n_sheets":4,"sheets":["Tableau de bord","Indicateurs","Base de données","Paramètres"],"not_rendered":{"charts":9,"images":0,"macros":1,"external_links":0,"defined_names":14,"comments":0,"pivot_tables":0},"unopened":[],"bounds":{"document_bytes":16777216,"sheet_cells":100000,"rows_first":2000,"rows_last":500,"rows_between":2000,"halvings":0,"cell_chars":16384,"cell_head_chars":4096},"cells_cut":0,"cells_raw":0,"read":"whole","date_system":"1900"}

{"sheet":"Tableau de bord","index":0,"n_rows":7,"n_cols":5,"rows_kept":7,"cut":false,"hidden":false,"merged":[[4,0,4,4]]}
[]
[]
[]
[]
[]
[]
[{"$f":"IF(ISBLANK(Paramètres!$K$4)=TRUE,TODAY()-WEEKDAY(TODAY(),2),Paramètres!$K$4+7-WEEKDAY(Paramètres!$K$4,2))","v":"2023-12-31"},null,null,null,{"$f":"NOW()","v":"2024-01-17T05:16:32.830"}]

{"sheet":"Indicateurs","index":1,"n_rows":83,"n_cols":27,"rows_kept":83,"cut":false,"hidden":false,"merged":[[13,0,13,5],[18,0,18,4],[21,0,21,4],[24,0,24,4],[29,0,29,26]]}
["Article","Type","Semaine du","Au","Qté Bonne","Qté KO","Temps Prévu","Temps Réel","Obj Qté","TQ","TC","TD","Perf Total"]
["Tous","Court Terme",{"$f":"IF(ISBLANK(Paramètres!$K$4)=TRUE,TODAY()-WEEKDAY(TODAY(),2)-6-(VLOOKUP(\"Durée court terme en S\",parametre,2,FALSE)-1)*7,Paramètres!$K$4-WEEKDAY(Paramètres!$K$4,2)+1-(VLOOKUP(\"Durée court terme en S\",parametre,2,FALSE)-1)*7)","v":"2023-12-25"},{"$f":"C2+6+7*(Paramètres!$K$2-1)","v":"2023-12-31"},{"$f":"SUM(E4,E6,E8,E10)","v":49869},{"$f":"SUM(F4,F6,F8,F10)","v":1210},647.65250000000003,649.97904803041092,{"$f":"SUM(I4,I6,I8,I10)","v":52500},{"$f":"IFERROR(E2/(E2+F2),0)","v":0.97631120421308171},{"$f":"IFERROR(G2/H2,0)","v":0.99642057995952193},{"$f":"E2/I2","v":0.94988571428571433},{"$f":"J2*K2*L2","v":0.92406456846953522}]
["Tous","Long Terme",{"$f":"IF(ISBLANK(Paramètres!$K$4)=TRUE,TODAY()-WEEKDAY(TODAY(),2)-6-(VLOOKUP(\"Durée long terme en S\",parametre,2,FALSE)-1)*7,Paramètres!$K$4-WEEKDAY(Paramètres!$K$4,2)+1-(VLOOKUP(\"Durée long terme en S\",parametre,2,FALSE)-1)*7)","v":"2023-10-23"},{"$f":"C3+6+7*(Paramètres!$K$3-1)","v":"2023-12-31"},{"$f":"SUM(E5,E7,E9,E11)","v":506937},{"$f":"SUM(F5,F7,F9,F11)","v":17890},6275.3294444444437,6348.834719031257,{"$f":"SUM(I5,I7,I9,I11)","v":525000},{"$f":"E3/(E3+F3)","v":0.96591257690629484},{"$f":"G3/H3","v":0.98842224158608605},{"$f":"E3/I3","v":0.96559428571428574},0.92188132492411412]
[653,"Court Terme",{"$f":"C2","v":"2023-12-25"},{"$f":"D2","v":"2023-12-31"},{"$f":"SUMIFS('Base de données'!$C:$C,'Base de données'!$F:$F,$A4,'Base de données'!$B:$B,\">=\"&Indicateurs!$C4,'Base de données'!$B:$B,\"<\"&(Indicateurs!$D4+1))","v":7563},{"$f":"SUMIFS('Base de données'!$D:$D,'Base de données'!$F:$F,$A4,'Base de données'!$B:$B,\">=\"&Indicateurs!$C4,'Base de données'!$B:$B,\"<\"&(Indicateurs!$D4+1))","v":226},{"$f":"_xlfn.XLOOKUP($A4,article,tpsTheorique,0,0)*SUM($E4:$F4)/3600","v":129.81666666666666},{"$f":"SUMIFS('Base de données'!$G:$G,'Base de données'!$F:$F,$A4,'Base de données'!$B:$B,\">=\"&Indicateurs!$C4,'Base de données'!$B:$B,\"<\"&(Indicateurs!$D4+1))/3600","v":133.1325495237117},{"$f":"_xlfn.XLOOKUP($A4,article,objectifHebdo,0,0)*Paramètres!$K$2","v":9500},0.97098472204390807,0.97509337221507608,0.79610526315789476,0.75375307376037193]
[653,"Long Terme",{"$f":"C3","v":"2023-10-23"},"2023-12-31",{"$f":"SUMIFS('Base de données'!$C:$C,'Base de données'!$F:$F,$A5,'Base de données'!$B:$B,\">=\"&Indicateurs!$C5,'Base de données'!$B:$B,\"<\"&(Indicateurs!$D5+1))","v":82235},{"$f":"SUMIFS('Base de données'!$D:$D,'Base de données'!$F:$F,$A5,'Base de données'!$B:$B,\">=\"&Indicateurs!$C5,'Base de données'!$B:$B,\"<\"&(Indicateurs!$D5+1))","v":2958},{"$f":"_xlfn.XLOOKUP($A5,article,tpsTheorique,0,0)*SUM($E5:$F5)/3600","v":1419.8833333333334},{"$f":"SUMIFS('Base de données'!$G:$G,'Base de données'!$F:$F,$A5,'Base de données'!$B:$B,\">=\"&Indicateurs!$C5,'Base de données'!$B:$B,\"<\"&(Indicateurs!$D5+1))/3600","v":1448.8773355539402},{"$f":"_xlfn.XLOOKUP($A5,article,objectifHebdo,0,0)*Paramètres!$K$3","v":95000},0.96527883746317189,0.97998864257924112,0.86563157894736842,0.81885483732733266]
[654,"Court Terme",{"$f":"C4","v":"2023-12-25"},"2023-12-31",{"$f":"SUMIFS('Base de données'!$C:$C,'Base de données'!$F:$F,$A6,'Base de données'!$B:$B,\">=\"&Indicateurs!$C6,'Base de données'!$B:$B,\"<\"&(Indicateurs!$D6+1))","v":13703},{"$f":"SUMIFS('Base de données'!$D:$D,'Base de données'!$F:$F,$A6,'Base de données'!$B:$B,\">=\"&Indicateurs!$C6,'Base de données'!$B:$B,\"<\"&(Indicateurs!$D6+1))","v":321},{"$f":"_xlfn.XLOOKUP($A6,article,tpsTheorique,0,0)*SUM($E6:$F6)/3600","v":128.55333333333334},{"$f":"SUMIFS('Base de données'!$G:$G,'Base de données'!$F:$F,$A6,'Base de données'!$B:$B,\">=\"&Indicateurs!$C6,'Base de données'!$B:$B,\"<\"&(Indicateurs!$D6+1))/3600","v":128.09854461468856},{"$f":"_xlfn.XLOOKUP($A6,article,objectifHebdo,0,0)*Paramètres!$K$2","v":17000},0.97711066742726749,1.0035503035574116,0.80605882352941172,0.79040492492532011]
[654,"Long Terme",{"$f":"C5","v":"2023-10-23"},"2023-12-31",{"$f":"SUMIFS('Base de données'!$C:$C,'Base de données'!$F:$F,$A7,'Base de données'!$B:$B,\">=\"&Indicateurs!$C7,'Base de données'!$B:$B,\"<\"&(Indicateurs!$D7+1))","v":162280},{"$f":"SUMIFS('Base de données'!$D:$D,'Base de données'!$F:$F,$A7,'Base de données'!$B:$B,\">=\"&Indicateurs!$C7,'Base de données'!$B:$B,\"<\"&(Indicateurs!$D7+1))","v":5763},{"$f":"_xlfn.XLOOKUP($A7,article,tpsTheorique,0,0)*SUM($E7:$F7)/3600","v":1540.3941666666667},{"$f":"SUMIFS('Base de données'!$G:$G,'Base de données'!$F:$F,$A7,'Base de données'!$B:$B,\">=\"&Indicateurs!$C7,'Base de données'!$B:$B,\"<\"&(Indicateurs!$D7+1))/3600","v":1556.5338458548219},{"$f":"_xlfn.XLOOKUP($A7,article,objectifHebdo,0,0)*Paramètres!$K$3","v":170000},0.96570520640550339,0.98963101301578726,0.95458823529411763,0.9122921695517896]
[655,"Court Terme",{"$f":"C6","v":"2023-12-25"},"2023-12-31",{"$f":"SUMIFS('Base de données'!$C:$C,'Base de données'!$F:$F,$A8,'Base de données'!$B:$B,\">=\"&Indicateurs!$C8,'Base de données'!$B:$B,\"<\"&(Indicateurs!$D8+1))","v":15731},{"$f":"SUMIFS('Base de données'!$D:$D,'Base de données'!$F:$F,$A8,'Base de données'!$B:$B,\">=\"&Indicateurs!$C8,'Base de données'!$B:$B,\"<\"&(Indicateurs!$D8+1))","v":252},{"$f":"_xlfn.XLOOKUP($A8,article,tpsTheorique,0,0)*SUM($E8:$F8)/3600","v":142.07111111111112},{"$f":"SUMIFS('Base de données'!$G:$G,'Base de données'!$F:$F,$A8,'Base de données'!$B:$B,\">=\"&Indicateurs!$C8,'Base de données'!$B:$B,\"<\"&(Indicateurs!$D8+1))/3600","v":139.45211006634187},{"$f":"_xlfn.XLOOKUP($A8,article,objectifHebdo,0,0)*Paramètres!$K$2","v":17500},0.98423324782581489,1.0187806483783093,0.89891428571428567,0.90135734271271784]
[655,"Long Terme",{"$f":"C7","v":"2023-10-23"},"2023-12-31",{"$f":"SUMIFS('Base de données'!$C:$C,'Base de données'!$F:$F,$A9,'Base de données'!$B:$B,\">=\"&Indicateurs!$C9,'Base de données'!$B:$B,\"<\"&(Indicateurs!$D9+1))","v":172823},{"$f":"SUMIFS('Base de données'!$D:$D,'Base de données'!$F:$F,$A9,'Base de données'!$B:$B,\">=\"&Indicateurs!$C9,'Base de données'!$B:$B,\"<\"&(Indicateurs!$D9+1))","v":6103},{"$f":"_xlfn.XLOOKUP($A9,article,tpsTheorique,0,0)*SUM($E9:$F9)/3600","v":1590.4533333333334},{"$f":"SUMIFS('Base de données'!$G:$G,'Base de données'!$F:$F,$A9,'Base de données'!$B:$B,\">=\"&Indicateurs!$C9,'Base de données'!$B:$B,\"<\"&(Indicateurs!$D9+1))/3600","v":1582.9605646645346},{"$f":"_xlfn.XLOOKUP($A9,article,objectifHebdo,0,0)*Paramètres!$K$3","v":175000},0.96589092697539769,1.0047333893440276,0.98755999999999999,0.95839030675856574]
[656,"Court Terme",{"$f":"C8","v":"2023-12-25"},"2023-12-31",{"$f":"SUMIFS('Base de données'!$C:$C,'Base de données'!$F:$F,$A10,'Base de données'!$B:$B,\">=\"&Indicateurs!$C10,'Base de données'!$B:$B,\"<\"&(Indicateurs!$D10+1))","v":12872},{"$f":"SUMIFS('Base de données'!$D:$D,'Base de données'!$F:$F,$A10,'Base de données'!$B:$B,\">=\"&Indicateurs!$C10,'Base de données'!$B:$B,\"<\"&(Indicateurs!$D10+1))","v":411},{"$f":"_xlfn.XLOOKUP($A10,article,tpsTheorique,0,0)*SUM($E10:$F10)/3600","v":247.21138888888888},{"$f":"SUMIFS('Base de données'!$G:$G,'Base de données'!$F:$F,$A10,'Base de données'!$B:$B,\">=\"&Indicateurs!$C10,'Base de données'!$B:$B,\"<\"&(Indicateurs!$D10+1))/3600","v":249.29584382566867},{"$f":"_xlfn.XLOOKUP($A10,article,objectifHebdo,0,0)*Paramètres!$K$2","v":8500},0.96905819468493559,0.99163862940997349,1.5143529411764707,1.4552258483325735]
[656,"Long Terme",{"$f":"C9","v":"2023-10-23"},"2023-12-31",{"$f":"SUMIFS('Base de données'!$C:$C,'Base de données'!$F:$F,$A11,'Base de données'!$B:$B,\">=\"&Indicateurs!$C11,'Base de données'!$B:$B,\"<\"&(Indicateurs!$D11+1))","v":89599},{"$f":"SUMIFS('Base de données'!$D:$D,'Base de données'!$F:$F,$A11,'Base de données'!$B:$B,\">=\"&Indicateurs!$C11,'Base de données'!$B:$B,\"<\"&(Indicateurs!$D11+1))","v":3066},{"$f":"_xlfn.XLOOKUP($A11,article,tpsTheorique,0,0)*SUM($E11:$F11)/3600","v":1724.598611111111},{"$f":"SUMIFS('Base de données'!$G:$G,'Base de données'!$F:$F,$A11,'Base de données'!$B:$B,\">=\"&Indicateurs!$C11,'Base de données'!$B:$B,\"<\"&(Indicateurs!$D11+1))/3600","v":1760.4629729579599},{"$f":"_xlfn.XLOOKUP($A11,article,objectifHebdo,0,0)*Paramètres!$K$3","v":85000},0.96691307397615067,0.97962788062131811,1.0541058823529412,0.99846490904964591]
[]
[]
["Données pour le graphique performance totale production"]
["Performance","Performance","Performance","Objectifs","Objectifs","Objectifs"]
[{"$f":"IF(M2<1,MAX(M2,0.75),MIN(1.05,M2-0.001))","v":0.92406456846953522},1E-4,{"$f":"1-B16-A16","v":7.5835431530464792E-2},{"$f":"Paramètres!G5","v":0.79515000000000002},{"$f":"Paramètres!H5-D16","v":0.11742599999999992},{"$f":"2-D16-E16","v":1.0874239999999999}]
[]
[]
["Données pour les cadrans"]
["TQ",0.1,{"$f":"Paramètres!$H$2-Paramètres!$G$2","v":2.9999999999999916E-2},{"$f":"1.05-Paramètres!$H$2","v":9.000000000000008E-2},{"$f":"B20+C20+D20","v":0.22}]
[{"$f":"J2","v":0.97631120421308171},{"$f":"IF(A21>1.05,1.05,MAX(($A$21-Paramètres!$G$2+Indicateurs!$B$20)*1000,0))","v":146.31120421308165},0.01,{"$f":"IF(A21>1.05,1.05*1000,(1.05-$J$2)*1000+(1.05-Paramètres!$G$2+Indicateurs!$B$20)*1000)","v":293.68879578691832}]
[]
["TC",0.1,{"$f":"Paramètres!$H$3-Paramètres!$G$3","v":2.0000000000000018E-2},{"$f":"1.05-Paramètres!$H$3","v":8.0000000000000071E-2},{"$f":"B23+C23+D23","v":0.20000000000000009}]
[{"$f":"K2","v":0.99642057995952193},{"$f":"IF(A24>1.05,1.05*1000,MAX(($A$24-Paramètres!$G$3+Indicateurs!$B$23)*1000,0))","v":146.42057995952197},0.01,{"$f":"IF(A24>1.05,1.05*1000,(1.05-$K$2)*1000+(1.05-Paramètres!$G$3+Indicateurs!$B$23)*1000)","v":253.5794200404782}]
[]
["TD",0.1,{"$f":"Paramètres!$H$4-Paramètres!$G$4","v":7.999999999999996E-2},{"$f":"1.05-Paramètres!$H$4","v":7.0000000000000062E-2},{"$f":"B26+C26+D26","v":0.25}]
[{"$f":"L2","v":0.94988571428571433},{"$f":"IF(A27>1.05,1.05*1000,MAX(($A$27-Paramètres!$G$4+Indicateurs!$B$26)*1000,0))","v":149.88571428571433},0.01,{"$f":"IF(A27>1.05,1.05*1000,(1.05-$L$2)*1000+(1.05-Paramètres!$G$4+Indicateurs!$B$26)*1000)","v":350.1142857142857}]
[]
[]
["Données pour l'évolution jusqu'à 52 sem"]
{"$rows_left_out":54}
{"sheet":"Base de données","index":2,"n_rows":3001,"n_cols":8,"rows_kept":3001,"cut":false,"hidden":false,"merged":[]}
["ID Saisie","Date de livraison réelle","Qté bonne","Qté Rebut","Machine","Article","Tps Réel (s)","Saisie par"]
[1,"2023-12-30T02:40:16.407",885,32,3,655,26099.153697139336,"User 2"]
[2,"2023-04-05T07:46:58.628",931,30,2,654,24980.676542311125,"User 3"]
[3,"2023-05-02T14:02:35.351",928,4,1,653,55600.952544203952,"User 3"]
[4,"2023-11-11T09:35:15.702",912,8,3,655,35551.983332714844,"User 2"]
[5,"2023-07-06T00:22:45.862",862,71,3,656,67324.755970748112,"User 2"]
[6,"2023-11-10T13:19:31.288",969,21,2,654,34693.013233945516,"User 1"]
[7,"2023-06-06T04:15:56.719",970,17,2,654,32343.523664959419,"User 3"]
[8,"2023-11-18T08:45:07.114",901,74,3,655,32263.801852002682,"User 4"]
[9,"2023-07-06T05:10:42.170",940,56,3,655,33875.42413830007,"User 4"]
[10,"2023-10-09T16:57:19.265",974,6,3,654,27728.620296887711,"User 2"]
[11,"2023-09-07T12:03:13.805",927,23,2,655,27633.569950233184,"User 3"]
[12,"2023-12-03T00:08:36.813",922,27,4,653,52604.63228812439,"User 2"]
[13,"2023-08-03T17:49:55.514",871,29,4,656,73012.699114568619,"User 3"]
[14,"2023-01-23T02:01:12.292",969,28,3,653,66605.723969666869,"User 1"]
[15,"2023-11-25T06:18:59.756",869,78,1,654,30976.627610163057,"User 3"]
[16,"2023-02-12T06:26:59.654",958,23,2,656,63233.016647923789,"User 1"]
[17,"2023-04-08T08:34:02.640",970,8,2,654,29725.435168924534,"User 2"]
[18,"2023-11-27T16:10:15.253",925,19,2,654,30730.824303001504,"User 4"]
[19,"2023-10-07T01:14:08.280",965,16,3,655,30200.667863265229,"User 2"]
[20,"2023-02-24T23:59:04.627",912,23,4,654,30440.613924986479,"User 3"]
[21,"2023-09-17T19:12:03.692",919,54,2,656,69043.172409791485,"User 4"]
[22,"2023-08-06T14:37:02.602",962,26,3,655,30046.319837898678,"User 4"]
[23,"2023-07-27T04:00:15.381",898,35,2,655,25423.938146873897,"User 1"]
[24,"2023-04-07T21:38:11.049",931,5,4,653,52474.751403539121,"User 4"]
[25,"2023-05-25T05:07:37.595",885,58,3,653,54896.98521347584,"User 3"]
[26,"2023-09-05T12:19:50.515",871,72,2,654,38337.989690462651,"User 3"]
[27,"2023-04-18T11:10:56.014",914,61,4,656,60894.548241704419,"User 2"]
[28,"2023-02-01T09:42:20.226",886,23,3,656,59844.527738884528,"User 4"]
[29,"2023-03-12T03:38:24.892",882,48,2,655,32284.232969621149,"User 3"]
{"$rows_left_out":2972}
{"sheet":"Paramètres","index":3,"n_rows":6,"n_cols":11,"rows_kept":6,"cut":false,"hidden":false,"merged":[]}
["Article","Objectif hebdo","Tps Théorique (s)",{"$f":"K5","v":"2023-01-01"},null,"Indicateur","Min acceptable","Top",null,"Paramètre","Valeur"]
[653,9500,60,0,null,"Qualité",0.93,0.96,null,"Durée court terme en S",1]
[654,17000,33,0,null,"Coût",0.95,0.97,null,"Durée long terme en S",10]
[655,17500,32,0,null,"Délai",0.9,0.98,null,"Date de fin","2023-12-30"]
[656,8500,67,0,null,"Total",{"$f":"G2*G3*G4","v":0.79515000000000002},{"$f":"H2*H3*H4","v":0.91257599999999994},null,"Date de début","2023-01-01"]
[null,null,null,null,null,null,null,null,null,"Répertoire d'exportation du PDF"]